{"text_format":"3","workbook":"xlsx","n_sheets":5,"sheets":["Form","Form (translations)","Dropdown menus","Dropdown menus (translations)","Pictures"],"not_rendered":{"images":1,"defined_names":11,"comments":1},"read":"whole","date_system":"1900"}

{"sheet":"Form","index":0,"n_rows":60,"n_cols":25,"rows_kept":60,"merged":[[0,20,0,23],[1,20,1,23],[2,7,2,19],[2,20,2,23],[3,7,3,19],[6,4,6,10],[6,13,6,17],[8,6,8,12],[8,17,8,19],[10,7,10,12],[10,17,10,19],[12,6,12,20],[14,9,14,24],[16,6,16,10],[16,17,16,20],[19,11,19,24],[21,10,21,14],[21,23,21,24],[23,10,23,14],[23,23,23,24],[27,1,30,24],[33,1,34,16],[33,17,35,24],[36,1,39,24],[40,6,40,10],[41,1,42,24],[45,1,47,24],[48,7,48,10],[48,13,48,23],[51,1,52,24],[54,1,56,24],[54,25,56,25],[59,1,59,4],[60,1,80,25]]}
[1,{"$nulls":19},{"$f":"'Form (translations)'!A4","v":"Date"}]
[{"$nulls":20},{"$f":"'Form (translations)'!A6","v":"Reported By"}]
[{"$nulls":7},{"$f":"'Form (translations)'!A3","v":"Warranty Intervention Request"},{"$nulls":12},{"$f":"'Form (translations)'!A8","v":"Report Number"}]
[{"$nulls":20},{"$f":"Y59","v":"WIR 4700305 version 2013-01 xltx"}]
[null,{"$f":"'Form (translations)'!A10","v":"General Information"}]
[]
[null,{"$f":"'Form (translations)'!A11","v":"Product"},null,null,"-Select-",{"$nulls":7},{"$f":"'Form (translations)'!A12","v":"Model"},"-Select-",{"$nulls":9},{"$f":"'Form (translations)'!A13","v":"Machine Serial Number"}]
[]
[null,{"$f":"'Form (translations)'!A14","v":"Customer Name"},{"$nulls":14},{"$f":"'Form (translations)'!A24","v":"Delivery Date"},{"$nulls":6},{"$f":"'Form (translations)'!A16","v":"Working Hours"}]
[]
[null,{"$f":"'Form (translations)'!A15","v":"Contact Name"},{"$nulls":14},{"$f":"'Form (translations)'!A25","v":"Failure Date"},{"$nulls":6},{"$f":"'Form (translations)'!A17","v":"Phone Number"}]
[]
[null,{"$f":"'Form (translations)'!A19","v":"E-Mail"},{"$nulls":21},{"$f":"'Form (translations)'!A18","v":"Fax Number"}]
[]
[null,{"$f":"'Form (translations)'!A20","v":"Intervention Address"}]
{"$rows_left_out":46}
{"sheet":"Form (translations)","index":1,"n_rows":51,"n_cols":8,"rows_kept":51,"hidden":true}
[{"$f":"Form!A1","v":1},"ENGLISH","ITALIAN","SPANISH","PORTUGUESE","FRENCH","GERMAN","DUTCH"]
[]
[{"$f":"IF($A$1=1,'Form (translations)'!$B3,IF($A$1=2,'Form (translations)'!$C3,IF($A$1=3,'Form (translations)'!$D3,IF($A$1=7,'Form (translations)'!$E3,IF($A$1=4,'Form (translations)'!$F3,IF($A$1=5,'Form (translations)'!$G3,IF($A$1=6,'Form (translations)'!$H3,0)))))))","v":"Warranty Intervention Request"},"Warranty Intervention Request","Richiesta di intervento in garanzia","Solicitud de intervención bajo garantía","Pedido de Intervenção ao Abrigo da Garantia","Demande d’intervention au titre de la garantie","Gewährleistungsforderung","Verzoek om garantietussenkomst"]
[{"$f":"IF($A$1=1,'Form (translations)'!$B4,IF($A$1=2,'Form (translations)'!$C4,IF($A$1=3,'Form (translations)'!$D4,IF($A$1=7,'Form (translations)'!$E4,IF($A$1=4,'Form (translations)'!$F4,IF($A$1=5,'Form (translations)'!$G4,IF($A$1=6,'Form (translations)'!$H4,0)))))))","v":"Date"},"Date","Data","Fecha","Data","Date","Datum","Datum"]
[{"$f":"IF($A$1=1,'Form (translations)'!$B5,IF($A$1=2,'Form (translations)'!$C5,IF($A$1=3,'Form (translations)'!$D5,IF($A$1=7,'Form (translations)'!$E5,IF($A$1=4,'Form (translations)'!$F5,IF($A$1=5,'Form (translations)'!$G5,IF($A$1=6,'Form (translations)'!$H5,0)))))))","v":"Please indicate the \"Report Date\" here"},"Please indicate the \"Report Date\" here","Inserire qui la \"data del rapporto\"","Indique aquí la \"Fecha del informe\"","P.f. Indique aqui a data do relatório","Veuillez indiquer ici la \"date du rapport\"","Bitte hier das „Berichtsdatum“ angeben","Typ hier de \"Rapportdatum\""]
[{"$f":"IF($A$1=1,'Form (translations)'!$B6,IF($A$1=2,'Form (translations)'!$C6,IF($A$1=3,'Form (translations)'!$D6,IF($A$1=7,'Form (translations)'!$E6,IF($A$1=4,'Form (translations)'!$F6,IF($A$1=5,'Form (translations)'!$G6,IF($A$1=6,'Form (translations)'!$H6,0)))))))","v":"Reported By"},"Reported By","Inviato da","Informe realizado por","Reportado por","Auteur","Erstellt von","Gerapporteerd door"]
[{"$f":"IF($A$1=1,'Form (translations)'!$B7,IF($A$1=2,'Form (translations)'!$C7,IF($A$1=3,'Form (translations)'!$D7,IF($A$1=7,'Form (translations)'!$E7,IF($A$1=4,'Form (translations)'!$F7,IF($A$1=5,'Form (translations)'!$G7,IF($A$1=6,'Form (translations)'!$H7,0)))))))","v":"Please indicate your full \"name\" here"},"Please indicate your full \"name\" here","Indicare qui in forma completa il \"nome\"","Indique aquí su \"Nombre\"","Indique aqui o \"Nome\"","Indiquez ici votre \"nom\" complet","Hier bitte Ihren vollständigen „Namen“ angeben","Typ hier uw volledige \"naam\""]
[{"$f":"IF($A$1=1,'Form (translations)'!$B8,IF($A$1=2,'Form (translations)'!$C8,IF($A$1=3,'Form (translations)'!$D8,IF($A$1=7,'Form (translations)'!$E8,IF($A$1=4,'Form (translations)'!$F8,IF($A$1=5,'Form (translations)'!$G8,IF($A$1=6,'Form (translations)'!$H8,0)))))))","v":"Report Number"},"Report Number","Rapporto numero","Número de informe","Nº de Relatório","Numéro du rapport","Berichtsnummer","Rapportnummer"]
[{"$f":"IF($A$1=1,'Form (translations)'!$B9,IF($A$1=2,'Form (translations)'!$C9,IF($A$1=3,'Form (translations)'!$D9,IF($A$1=7,'Form (translations)'!$E9,IF($A$1=4,'Form (translations)'!$F9,IF($A$1=5,'Form (translations)'!$G9,IF($A$1=6,'Form (translations)'!$H9,0)))))))","v":"Please indicate the \"Report Number\" here"},"Please indicate the \"Report Number\" here","Inserire qui il numero del rapporto","Indique aquí el \"Número de informe\"","Indique aqui o “Número do Relatório”","Veuillez indiquer ici le « numéro du rapport »","Bitte hier die „Berichtsnummer“ angeben ","Typ hier het \"Rapportnummer\""]
[{"$f":"IF($A$1=1,'Form (translations)'!$B10,IF($A$1=2,'Form (translations)'!$C10,IF($A$1=3,'Form (translations)'!$D10,IF($A$1=7,'Form (translations)'!$E10,IF($A$1=4,'Form (translations)'!$F10,IF($A$1=5,'Form (translations)'!$G10,IF($A$1=6,'Form (translations)'!$H10,0)))))))","v":"General Information"},"General Information","Informazioni Generali","Información General","Informação Geral","Informations Générales","Allgemeine Informationen","Algemene Informatie"]
[{"$f":"IF($A$1=1,'Form (translations)'!$B11,IF($A$1=2,'Form (translations)'!$C11,IF($A$1=3,'Form (translations)'!$D11,IF($A$1=7,'Form (translations)'!$E11,IF($A$1=4,'Form (translations)'!$F11,IF($A$1=5,'Form (translations)'!$G11,IF($A$1=6,'Form (translations)'!$H11,0)))))))","v":"Product"},"Product","Prodotto","Producto","Produto","Produit","Produkt","Product"]
[{"$f":"IF($A$1=1,'Form (translations)'!$B12,IF($A$1=2,'Form (translations)'!$C12,IF($A$1=3,'Form (translations)'!$D12,IF($A$1=7,'Form (translations)'!$E12,IF($A$1=4,'Form (translations)'!$F12,IF($A$1=5,'Form (translations)'!$G12,IF($A$1=6,'Form (translations)'!$H12,0)))))))","v":"Model"},"Model","Modello","Modelo","Modelo","Modèle","Modell","Model"]
[{"$f":"IF($A$1=1,'Form (translations)'!$B13,IF($A$1=2,'Form (translations)'!$C13,IF($A$1=3,'Form (translations)'!$D13,IF($A$1=7,'Form (translations)'!$E13,IF($A$1=4,'Form (translations)'!$F13,IF($A$1=5,'Form (translations)'!$G13,IF($A$1=6,'Form (translations)'!$H13,0)))))))","v":"Machine Serial Number"},"Machine Serial Number","Numero di serie della macchina","Número de serie de la máquina","Número de Série da Máquina","Numéro de série de la machine","Seriennummer der Maschine","Serienummer machine"]
[{"$f":"IF($A$1=1,'Form (translations)'!$B14,IF($A$1=2,'Form (translations)'!$C14,IF($A$1=3,'Form (translations)'!$D14,IF($A$1=7,'Form (translations)'!$E14,IF($A$1=4,'Form (translations)'!$F14,IF($A$1=5,'Form (translations)'!$G14,IF($A$1=6,'Form (translations)'!$H14,0)))))))","v":"Customer Name"},"Customer Name","Cliente","Cliente","Cliente","Nom du client","Kundenname","Naam klant"]
[{"$f":"IF($A$1=1,'Form (translations)'!$B15,IF($A$1=2,'Form (translations)'!$C15,IF($A$1=3,'Form (translations)'!$D15,IF($A$1=7,'Form (translations)'!$E15,IF($A$1=4,'Form (translations)'!$F15,IF($A$1=5,'Form (translations)'!$G15,IF($A$1=6,'Form (translations)'!$H15,0)))))))","v":"Contact Name"},"Contact Name","Nome del contatto","Nombre de contacto","Nome do Contacto","Nom du contact","Name der Kontaktperson","Naam contactpersoon"]
{"$rows_left_out":37}
{"sheet":"Dropdown menus","index":2,"n_rows":83,"n_cols":46,"rows_kept":83,"hidden":true}
[null,"Product",{"$f":"Form!E7","v":"-Select-"},"Model HEX","Model WEX","Model WL","Model ADT","Model DTH","Model LDR","Model MT","Model BAL","Model UV","Model WM","Model MEX","Model TLS","Model ATT","Model COMP","Model TOOLS","Model GEN","Model LC","Model LT",{"$f":"Form!#REF!","v":{"$error":"#REF!"}},"Attachment (HEAVY + COMPACT)","Attachment COMP",{"$f":"Form!#REF!","v":{"$error":"#REF!"}},"Options (HEX/WEX)","Options (COMP)","Options (GEN/LT)",{"$f":"Form!#REF!","v":{"$error":"#REF!"}},"Application (HEAVY + COMPACT)","Application COMP","Application TOOLS/LC","Application GEN",{"$f":"Form!#REF!","v":{"$error":"#REF!"}},"Work type (HEAVY + COMPACT)","Work type COMP","Work type GEN",{"$f":"Form!#REF!","v":{"$error":"#REF!"}},"Material (HEAVY + COMPACT)","Severity","Warranty","Type of Problem","Error Codes","Diagnostic Software Report File","Symptom code","Symptom code COMP"]
[null,"-Select-",{"$f":"IF($C$1=$B$2,$D$2,IF($C$1=$B$3,$D2,IF($C$1=$B$4,$E2,IF($C$1=$B$5,$F2,IF($C$1=$B$6,$G2,IF($C$1=$B$7,$H2,IF($C$1=$B$8,$I2,IF($C$1=$B$9,$J2,IF($C$1=$B$10,$K2,IF($C$1=$B$11,$L2,IF($C$1=$B$12,$M2,IF($C$1=$B$13,$N2,IF($C$1=$B$14,$O2,IF($C$1=$B$15,$P2,IF($C$1=$B$16,$Q2,IF($C$1=$B$17,$R2,IF($C$1=$B$18,$S2,IF($C$1=$B$19,$T2,IF($C$1=$B$20,$U2,IF($C$1=$B$21,$B$21,\"\"))))))))))))))))))))","v":"-Select-"},"-Select-","-Select-","-Select-","-Select-","-Select-","-Select-","-Select-","-Select-","-Select-","-Select-","-Select-","-Select-","-Select-","-Select-","-Select-","-Select-","-Select-","-Select-",{"$f":"IF($C$1=$B$2,$W$2,IF(OR($C$1=$B$3,$C$1=$B$4,$C$1=$B$5,$C$1=$B$6,$C$1=$B$7,$C$1=$B$8,$C$1=$B$9,$C$1=$B$10,$C$1=$B$11,$C$1=$B$12,$C$1=$B$13,$C$1=$B$14),$W2,IF($C$1=$B$16,$X2,\"\")))","v":"-Select-"},"-Select-","-Select-",{"$f":"IF($C$1=$B$2,$Z$2,IF(OR($C$1=$B$3,$C$1=$B$4),$Z2,IF($C$1=$B$16,$AA2,IF(OR($C$1=$B$18,$C$1=$B$20),$AB2,\"\"))))","v":"-Select-"},"-Select-","-Select-","-Select-",{"$f":"IF($C$1=$B$2,$AD$2,IF(OR($C$1=$B$3,$C$1=$B$4,$C$1=$B$5,$C$1=$B$6,$C$1=$B$7,$C$1=$B$8,$C$1=$B$9,$C$1=$B$10,$C$1=$B$11,$C$1=$B$12,$C$1=$B$13,$C$1=$B$14,$C$1=$B$15),$AD2,IF(OR($C$1=$B$16),$AE2,IF(OR($C$1=$B$17,$C$1=$B$19),$AF2,IF(OR($C$1=$B$18,$C$1=$B$20),$AG2,\"\")))))","v":"-Select-"},"-Select-","-Select-","-Select-","-Select-",{"$f":"IF($C$1=$B$2,$AI$2,IF(OR($C$1=$B$3,$C$1=$B$4,$C$1=$B$5,$C$1=$B$6,$C$1=$B$7,$C$1=$B$8,$C$1=$B$9,$C$1=$B$10,$C$1=$B$11,$C$1=$B$12,$C$1=$B$13,$C$1=$B$14,$C$1=$B$15),$AI2,IF(OR($C$1=$B$16),$AJ2,IF(OR($C$1=$B$18,$C$1=$B$20),$AK2,\"\"))))","v":"-Select-"},"-Select-","-Select-","-Select-",{"$f":"IF($C$1=$B$2,$AM$2,IF(OR($C$1=$B$3,$C$1=$B$4,$C$1=$B$5,$C$1=$B$6,$C$1=$B$7,$C$1=$B$8,$C$1=$B$9,$C$1=$B$10,$C$1=$B$11,$C$1=$B$12,$C$1=$B$13,$C$1=$B$14,$C$1=$B$15),$AM2,\"\"))","v":"-Select-"},"-Select-","-Select-","-Select-","-Select-","-Select-","-Select-","-Select-","-Select-"]
[null,"Heavy Excavator HEX",{"$f":"IF($C$1=$B$2,$D$2,IF($C$1=$B$3,$D3,IF($C$1=$B$4,$E3,IF($C$1=$B$5,$F3,IF($C$1=$B$6,$G3,IF($C$1=$B$7,$H3,IF($C$1=$B$8,$I3,IF($C$1=$B$9,$J3,IF($C$1=$B$10,$K3,IF($C$1=$B$11,$L3,IF($C$1=$B$12,$M3,IF($C$1=$B$13,$N3,IF($C$1=$B$14,$O3,IF($C$1=$B$15,$P3,IF($C$1=$B$16,$Q3,IF($C$1=$B$17,$R3,IF($C$1=$B$18,$S3,IF($C$1=$B$19,$T3,IF($C$1=$B$20,$U3,IF($C$1=$B$21,$B$21,\"\"))))))))))))))))))))","v":"-Select-"},"DX140LC","DX140W","DL160","MT25","DT70","A300","MT52","AL275",2200,5600,325,"T2250","Angle Broom","10/105","IR10PV","G10","BX-120WH","BL1200HMI",{"$f":"IF($C$1=$B$2,$W$2,IF(OR($C$1=$B$3,$C$1=$B$4,$C$1=$B$5,$C$1=$B$6,$C$1=$B$7,$C$1=$B$8,$C$1=$B$9,$C$1=$B$10,$C$1=$B$11,$C$1=$B$12,$C$1=$B$13,$C$1=$B$14),$W3,IF($C$1=$B$16,$X3,\"\")))","v":"-Select-"},"Breaker","Aftercooler",{"$f":"IF($C$1=$B$2,$Z$2,IF(OR($C$1=$B$3,$C$1=$B$4),$Z3,IF($C$1=$B$16,$AA3,IF(OR($C$1=$B$18,$C$1=$B$20),$AB3,\"\"))))","v":"-Select-"},"Cabin Riser","Aftercooler","3 way Fuel Valve",{"$f":"IF($C$1=$B$2,$AD$2,IF(OR($C$1=$B$3,$C$1=$B$4,$C$1=$B$5,$C$1=$B$6,$C$1=$B$7,$C$1=$B$8,$C$1=$B$9,$C$1=$B$10,$C$1=$B$11,$C$1=$B$12,$C$1=$B$13,$C$1=$B$14,$C$1=$B$15),$AD3,IF(OR($C$1=$B$16),$AE3,IF(OR($C$1=$B$17,$C$1=$B$19),$AF3,IF(OR($C$1=$B$18,$C$1=$B$20),$AG3,\"\")))))","v":"-Select-"},"Agricultural","Auto-Start","Building Construction","Construction",{"$f":"IF($C$1=$B$2,$AI$2,IF(OR($C$1=$B$3,$C$1=$B$4,$C$1=$B$5,$C$1=$B$6,$C$1=$B$7,$C$1=$B$8,$C$1=$B$9,$C$1=$B$10,$C$1=$B$11,$C$1=$B$12,$C$1=$B$13,$C$1=$B$14,$C$1=$B$15),$AI3,IF(OR($C$1=$B$16),$AJ3,IF(OR($C$1=$B$18,$C$1=$B$20),$AK3,\"\"))))","v":"-Select-"},"Carrying","Backup Compressor","Capacitor Banks",{"$f":"IF($C$1=$B$2,$AM$2,IF(OR($C$1=$B$3,$C$1=$B$4,$C$1=$B$5,$C$1=$B$6,$C$1=$B$7,$C$1=$B$8,$C$1=$B$9,$C$1=$B$10,$C$1=$B$11,$C$1=$B$12,$C$1=$B$13,$C$1=$B$14,$C$1=$B$15),$AM3,\"\"))","v":"-Select-"},"Cement","Light Defect","Standard Warranty","Intermittent","YES (please specify below)","YES (please specify below)","Leakage(Oil)","Oil Carry-over"]
[null,"Wheeled Excavator WEX","-Select-","DX140LC-3","DX140W-3","DL200","MT26","DT120","A770","MT55","AL350",3400,"Others (Type here)",328,"T2556","Auger","10/125","IR12PS","G100","BX-60WH","BL2000A","-Select-","Bucket, Narrow","Coupling","-Select-","Demolition machine","Auto Start","Adjustable Earth Leakage Protection","-Select-","Building / Grounds","Chemical Plant","Coast Protection","Event / Concert","-Select-","Concrete Mixing","Blasting (Sand-Dry Ice)","Concrete Mixers","-Select-","Charcoal","Performance Drop","Extended Warranty","Permanent","NO","NO","Leakage(Gas)","Power Decrease"]
[null,"Wheel Loader WL","-Select-","DX140LCR","DX160W","DL200-3","MT31","DT160","S100","Others (Type here)","AL440","3400XL",{"$f":"\" \"","v":" "},425,"T2566","Backhoe","10/370","IR12PV","G110","BX-80WH","BL2000B","-Select-","Bucket, Rock","Dryer","-Select-","Forestry Machine","Chalwyn Valve","Air Shut Off Valve","-Select-","Civil Work","Desert","Dam Construction","Rental","-Select-","Demolition","Drilling","Disk Saws","-Select-","Clay, Dry","Machine Down","Out of Warranty",{"$nulls":3},"Leakage(Water)","Fire"]
[null,"Articulated Dump Truck ADT","-Select-","DX140LCR-3","DX160WRR","DL200TC","MT36","DT210","S130",{"$f":"\" \"","v":" "},"Others (Type here)","Others (Type here)"," ",428,"T35100","Bale Squeeze Handler with Tines","10/455","IR15","G130","BXR-100H","BL2000HMI","-Select-","Bucket, Standard","Engine","-Select-","Long Arm","Cold Start","Auto Start with Timer & Photocell","-Select-","Coast Protection","Drill Rig","Land Development","Stand-by / Back-up","-Select-","Digging / Excavating","Main Compressor","Electrical Drills","-Select-","Clay, Wet","Safety Related",{"$nulls":4},"Rust","Overspeed"]
[null,"Doosan Telescopic Handler DTH","-Select-","DX160HT","DX160W-3","DL200TC-3","MT41","Others (Type here)","S150",{"$f":"\" \"","v":" "}," "," "," ",442,"T35100L","Bale Squeeze Handler with Tubes","12/150","IR15BV","G16","DX-500E","LSV9","-Select-","Bucket, Wide","Filter Package","-Select-","Long Boom","Dual Pressure","Cold Start Package","-Select-","Construction","Nuclear Plant","River, Canal & Irrigation","Others (Type here)","-Select-","Dozing","Pipeline Cleaning / Drying","Fans","-Select-","Coal",{"$nulls":5},"Crack","Others (Type here)"]
[null,"Compact Loader LDR","-Select-","DX160HT-3","DX170W","DL200A","DA30",{"$f":"\" \"","v":" "},"S160"," "," "," "," ",444,"T35100SL","Box Blade","12/235","IR17JS","G150","DX-700E","LT6K","-Select-","Compactor","Others (Type here)","-Select-","Material Handler","Generator","Digital Control Panel","-Select-","Dam Construction","Off-Shore","Road or Railroad Construction",{"$f":"\" \"","v":" "},"-Select-","Handling, Block","Others (Type here)","Heating","-Select-","Coke",{"$nulls":5},"Take off"]
[null,"Mini-Track Loader MT","-Select-","DX160LC","DX170W-3","DL250","DA40",{"$f":"\" \"","v":" "},"S175"," "," "," "," ","319K","T35120","Breaker, Hydraulic","12/56","IR17JV","G160","RX-264H","Others (Type here)","-Select-","Crusher/Pulver",{"$f":"\" \"","v":" "},"-Select-","Standard Machine","IQ System","Heavy Duty Impregnation for alternator","-Select-","Demolition","Petrochemical Plant","Others (Type here)"," ","-Select-","Handling, Log",{"$f":"\" \"","v":" "},"Incandescent Lightning","-Select-","Dolomite",{"$nulls":5},"Noise"]
[null,"Bobcat Articulated Loader BAL","-Select-","DX160LC-3","DX190W","DL250-3","Others (Type here)"," ","S185"," "," "," "," ","321K","T35120L","Brush Saw","14/115","IR20","G20","RX-344H",{"$f":"\" \"","v":" "},"-Select-","Fork"," ","-Select-","Super Long Reach","Low Fuel","Mains Power Supply Connector","-Select-","Forestry","Plant Air",{"$f":"\" \"","v":" "}," ","-Select-","Handling, Material"," ","Metal Halide Lamps","-Select-","Earth, Dry",{"$nulls":5},"Loose"]
[null,"Utility Vehicle UV","-Select-","DX180HT","DX190W-3","DL250TC",{"$f":"\" \"","v":" "}," ","S205"," "," "," "," ","323K","T35120SL","Brushcat Rotary Cutter","14/85","IR20BV","G200","Others (Type here)"," ","-Select-","Forks, Pallet"," ","-Select-","Others (Type here)","Lubricator","Refinery Kit","-Select-","Landscaping","Rental"," "," ","-Select-","Handling, Pallet"," ","Motor Starting","-Select-","Earth, Wet",{"$nulls":5},"Wear"]
[null,"Work Machine WM","-Select-","DX180HT-3","DX190WMH","DL250TC-3"," "," ","S250"," "," "," "," ","DX15","T35120SL MP","Bucket, Clamshell","17/235","IR23JS","G22",{"$f":"\" \"","v":" "}," ","-Select-","Grapple"," ","-Select-",{"$f":"\" \"","v":" "},"Spark Arrestor","Remote Orientation of Lamps","-Select-","Material Handling","Others (Type here)"," "," ","-Select-","Handling, Tire"," ","Office Buildings","-Select-","Gravel",{"$nulls":5},"Deformation"]
[null,"Compact Mini-Excavator MEX","-Select-","DX180LC","DX210W","DL250A"," "," ","S300"," "," "," "," ","DX18","T3571","Bucket, Clay Spade","21/215","IR23JV","G220"," "," ","-Select-","Man Platform"," ","-Select-",{"$f":"\" \"","v":" "},"Water Seperator","Sockets","-Select-","Mining",{"$f":"\" \"","v":" "}," "," ","-Select-","Handling, Waste"," ","Pumps","-Select-","Reinforced Concrete",{"$nulls":5},"Excessive Oil consumption"]
[null,"Compact Telescopic Handler TLS","-Select-","DX180LC-3","DX210WMH","DL300"," "," ","S330"," "," "," "," ","DX27Z","T3571L","Bucket, Combination","25/300","IR25","G250"," "," ","-Select-","Shear"," ","-Select-",{"$f":"\" \"","v":" "},"Others (Type here)","Spark Arrestor","-Select-","Miscellaneous"," "," "," ","-Select-","Leveling"," ","Synchronous Motors","-Select-","Rock Soft",{"$nulls":5},"Defective exterior"]
[null,"Attachment ATT","-Select-","DX225LC","S180W","DL300-3"," "," ","S510"," "," "," "," ","DX30Z","T40140","Bucket, Concrete","25/330","IR25BV","G270"," "," ","-Select-","Sweeper",null,"-Select-",{"$f":"\" \"","v":" "},{"$f":"\" \"","v":" "},"Others (Type here)","-Select-","Personal use",{"$f":"\" \"","v":" "}," "," ","-Select-","Lifting"," ","Tower Cranes","-Select-","Rock, Hard",{"$nulls":5},"Smoke"]
{"$rows_left_out":69}
{"sheet":"Dropdown menus (translations)","index":3,"n_rows":299,"n_cols":7,"rows_kept":299}
["ENGLISH (EN)","ITALIAN (IT)","SPANISH (ES)","PORTUGUESE (PT)","FRENCH (FR)","GERMAN (DE)","DUTCH (NL)"]
[]
["-Select-","-Selezionare-","-Seleccione-","- Seleccione - ","-Sélectionnez-","-Auswählen-","-Selecteren-"]
[]
["Product"]
["Heavy Excavator HEX","Escavatore pesante (HEX)","Excavadora pesada HEX","Escavadora gama pesada (HEX)","Pelle lourde HEX","Schwerer Bagger HEX","Zware graafmachine (HEX)"]
["Wheeled Excavator WEX","Escavatore gommato (WEX)","Excavadora de ruedas WEX","Escavadora de rodas (WEX)","Pelle sur roues WEX","Mobilbagger WEX","Mobiele graafmachine (WEX)"]
["Wheel Loader WL","Pala gommata (WL)","Cargadora de ruedas WL","Pá carregadora de rodas (WL)","Chargeuse sur roues WL","Radlader WL","Lader op wielen (WL)"]
["Articulated Dump Truck ADT","Dumper articolato (ADT)","Dúmper articulado ADT","Dumper articulado (ADT)","Tombereau articulé ADT","Knickgelenkter Muldenkipper ADT","Knikdumper (ADT)"]
["Doosan Telescopic Handler DTH","Telescopico Doosan (DTH)","Manipulador telescópico Doosan DTH","Manipulador telescópico Doosan (DTH)","Télescopique Doosan DTH","Doosan Teleskoplader DTH","Doosan verreiker (DTH)"]
["Compact Loader LDR","Pala compatta (LDR)","Cargadora compacta LDR","Pá carregadora compacta (LDR)","Chargeuse compacte LDR","Kompakt- & Raupenlader LDR","Compacte lader (LDR)"]
["Mini-Track Loader MT","Minipala cingolata (MT)","Minicargadora compacta de orugas MT","Mini-carregadora compacta de rastos (MT)","Mini-chargeuse sur chenilles MT","Mini-Raupenlader MT","Mini-rupslader (MT)"]
["Bobcat Articulated Loader BAL","Pala articolata Bobcat (BAL)","Cargadora articulada Bobcat BAL","Pá carregadora articulada Bobcat (BAL)","Chargeuse articulée Bobcat BAL","Bobcat Knicklader BAL","Bobcat gelede lader (BAL)"]
["Utility Vehicle UV","Veicolo utilitario (UV)","Vehículo multiusos UV","Veículo multiusos (UV)","Véhicule utilitaire UV","Nutzfahrzeug UV","Terreinwagen (UV)"]
["Work Machine WM","Macchina da lavoro (WM)","Máquina de trabajo WM","Máquina d etrabalho (WM)","Véhicule utilitaire WM","Arbeitsmaschine WM","Werkmachine (WM)"]
{"$rows_left_out":285}
{"sheet":"Pictures","index":4,"n_rows":2,"n_cols":2,"rows_kept":2}
[]
[null,"UNPROTECTED"]